Reaction Details
TargetHistamine H4 receptor
LigandBDBM50419456
Substrate/Competitorn/a
Meas. Tech.ChEMBL_789900 (CHEMBL1925207)
Ki 134.9±n/a nM
Citation Istyastono, EPNijmeijer, SLim, HDvan de Stolpe, ARoumen, LKooistra, AJVischer, HFde Esch, IJLeurs, Rde Graaf, C Molecular determinants of ligand binding modes in the histamine H(4) receptor: linking ligand-based three-dimensional quantitative structure-activity relationship (3D-QSAR) models to in silico guided receptor mutagenesis studies. J Med Chem54:8136-47 (2011) 
 
Histamine H4 receptor
Name:Histamine H4 receptor
Type:G Protein-Coupled Receptor (GPCR)
Mol. Mass.:44517.02
Organism:Homo sapiens (Human)
Description:Binding assays were using CHO cells stably expressing hH4R receptors.
Residue:390
BDBM50419456
NameBDBM50419456
Synonyms:CHEMBL1923034
TypeSmall organic molecule
Emp. Form.C20H27N5O2S
Mol. Mass.401.526
SMILES[O-][N+](=O)c1ccc(CNC(SCCCc2cnc[nH]2)=NC2CCCCC2)cc1