Reaction Details
TargetMuscarinic acetylcholine receptor M3
LigandBDBM50419488
Substrate/Competitorn/a
Meas. Tech.ChEMBL_789189 (CHEMBL1924273)
IC50 0.316±n/a nM
Citation Mete, ABowers, KChevalier, EDonald, DKEdwards, HEscott, KJFord, RGrime, KMillichip, ITeobald, BRussell, V The discovery of AZD9164, a novel muscarinic M3 antagonist. Bioorg Med Chem Lett21:7440-6 (2011) 
 
Muscarinic acetylcholine receptor M3
Name:Muscarinic acetylcholine receptor M3
Type:Enzyme
Mol. Mass.:66151.03
Organism:Homo sapiens (Human)
Description:P20309
Residue:590
BDBM50419488
NameBDBM50419488
Synonyms:CHEMBL1921932
TypeSmall organic molecule
Emp. Form.C30H41N2O3
Mol. Mass.477.6576
SMILESCc1ccc(OCC[N+]23CCC(CC2)[C@H](C3)OC(=O)[C@@](C)(N2CCCCC2)c2ccccc2)cc1