Reaction Details
TargetMuscarinic acetylcholine receptor M3
LigandBDBM50419503
Substrate/Competitorn/a
Meas. Tech.ChEMBL_789189 (CHEMBL1924273)
IC50 0.2±n/a nM
Citation Mete, ABowers, KChevalier, EDonald, DKEdwards, HEscott, KJFord, RGrime, KMillichip, ITeobald, BRussell, V The discovery of AZD9164, a novel muscarinic M3 antagonist. Bioorg Med Chem Lett21:7440-6 (2011) 
 
Muscarinic acetylcholine receptor M3
Name:Muscarinic acetylcholine receptor M3
Type:Enzyme
Mol. Mass.:66151.03
Organism:Homo sapiens (Human)
Description:P20309
Residue:590
BDBM50419503
NameBDBM50419503
Synonyms:CHEMBL1921910
TypeSmall organic molecule
Emp. Form.C33H41N2O2
Mol. Mass.497.6903
SMILESC[C@@](N1CCCCC1)(C(=O)O[C@H]1C[N+]2(CCc3ccc4ccccc4c3)CCC1CC2)c1ccccc1