Reaction Details
TargetMuscarinic acetylcholine receptor M2
LigandBDBM50296345
Substrate/Competitorn/a
Meas. Tech.ChEMBL_789190 (CHEMBL1924274)
IC50 0.0631±n/a nM
Citation Mete, ABowers, KChevalier, EDonald, DKEdwards, HEscott, KJFord, RGrime, KMillichip, ITeobald, BRussell, V The discovery of AZD9164, a novel muscarinic M3 antagonist. Bioorg Med Chem Lett21:7440-6 (2011) 
 
Muscarinic acetylcholine receptor M2
Name:Muscarinic acetylcholine receptor M2
Type:GPCR
Mol. Mass.:51730.61
Organism:Homo sapiens (Human)
Description:P08172
Residue:466
BDBM50296345
NameBDBM50296345
Synonyms:(1R,2R,4S,5R,7S)-7-(2-hydroxy-2,2-di-thiophen-2-yl-acetoxy)-9,9-dimethyl-3-oxa-9-azonia-tricyclo[3.3.1.0*2,4*]nonane bromide Tiotropium Bromide
TypeSmall organic molecule
Emp. Form.C19H22NO4S2
Mol. Mass.392.512
SMILESC[N+]1(C)[C@@H]2C[C@H](C[C@@H]1[C@@H]1O[C@H]21)OC(=O)C(O)(c1cccs1)c1cccs1