Reaction Details
TargetMuscarinic acetylcholine receptor M3
LigandBDBM50419530
Substrate/Competitorn/a
Meas. Tech.ChEMBL_789189 (CHEMBL1924273)
IC50 0.251±n/a nM
Citation Mete, ABowers, KChevalier, EDonald, DKEdwards, HEscott, KJFord, RGrime, KMillichip, ITeobald, BRussell, V The discovery of AZD9164, a novel muscarinic M3 antagonist. Bioorg Med Chem Lett21:7440-6 (2011) 
 
Muscarinic acetylcholine receptor M3
Name:Muscarinic acetylcholine receptor M3
Type:Enzyme
Mol. Mass.:66151.03
Organism:Homo sapiens (Human)
Description:P20309
Residue:590
BDBM50419530
NameBDBM50419530
Synonyms:CHEMBL1921928
TypeSmall organic molecule
Emp. Form.C29H41N2O2S
Mol. Mass.481.712
SMILESC[C@@](N1CCCCC1)(C(=O)O[C@H]1C[N+]2(CCCCc3ccccc3)CCC1CC2)c1cccs1