Reaction Details
TargetfMet-Leu-Phe receptor
LigandBDBM50419571
Substrate/Competitorn/a
Meas. Tech.ChEMBL_796441 (CHEMBL1937756)
IC50 1585±n/a nM
Citation Morley, ADKing, SRoberts, BLever, STeobald, BFisher, ACook, TParker, BWenlock, MPhillips, CGrime, K Lead optimisation of pyrazoles as novel FPR1 antagonists. Bioorg Med Chem Lett22:532-6 (2011) 
 
fMet-Leu-Phe receptor
Name:fMet-Leu-Phe receptor
Type:Enzyme Catalytic Domain
Mol. Mass.:38456.14
Organism:Homo sapiens (Human)
Description:gi_4503779
Residue:350
BDBM50419571
NameBDBM50419571
Synonyms:CHEMBL1934270
TypeSmall organic molecule
Emp. Form.C22H34N4O3S
Mol. Mass.434.595
SMILESC[C@H](NC(=O)c1c(C)nn(c1NS(=O)(=O)c1ccc(C)cc1)C(C)(C)C)C(C)(C)C