Reaction Details
TargetfMet-Leu-Phe receptor
LigandBDBM50419573
Substrate/Competitorn/a
Meas. Tech.ChEMBL_796441 (CHEMBL1937756)
IC50 1000±n/a nM
Citation Morley, ADKing, SRoberts, BLever, STeobald, BFisher, ACook, TParker, BWenlock, MPhillips, CGrime, K Lead optimisation of pyrazoles as novel FPR1 antagonists. Bioorg Med Chem Lett22:532-6 (2011) 
 
fMet-Leu-Phe receptor
Name:fMet-Leu-Phe receptor
Type:Enzyme Catalytic Domain
Mol. Mass.:38456.14
Organism:Homo sapiens (Human)
Description:gi_4503779
Residue:350
BDBM50419573
NameBDBM50419573
Synonyms:CHEMBL1934267
TypeSmall organic molecule
Emp. Form.C21H32N4O3S
Mol. Mass.420.569
SMILESCC(C)n1nc(C)c(C(=O)N[C@@H](C)C(C)(C)C)c1NS(=O)(=O)c1ccc(C)cc1