Reaction Details
TargetCytochrome P450 3A4
LigandBDBM50419561
Substrate/Competitorn/a
Meas. Tech.ChEMBL_796522 (CHEMBL1937837)
IC50<10000±n/a nM
Citation Morley, ADKing, SRoberts, BLever, STeobald, BFisher, ACook, TParker, BWenlock, MPhillips, CGrime, K Lead optimisation of pyrazoles as novel FPR1 antagonists. Bioorg Med Chem Lett22:532-6 (2011) 
 
Cytochrome P450 3A4
Name:Cytochrome P450 3A4
Type:Enzyme
Mol. Mass.:57349.57
Organism:Homo sapiens (Human)
Description:n/a
Residue:503
BDBM50419561
NameBDBM50419561
Synonyms:CHEMBL1934426
TypeSmall organic molecule
Emp. Form.C25H36N4O4S
Mol. Mass.488.643
SMILESC[C@H](NC(=O)c1c(C)nn(C2CCOCC2)c1NS(=O)(=O)c1ccc(cc1)C1CC1)C(C)(C)C