Reaction Details
TargetCytochrome P450 1A2
LigandBDBM50419562
Substrate/Competitorn/a
Meas. Tech.ChEMBL_796518 (CHEMBL1937833)
IC50<10000±n/a nM
Citation Morley, ADKing, SRoberts, BLever, STeobald, BFisher, ACook, TParker, BWenlock, MPhillips, CGrime, K Lead optimisation of pyrazoles as novel FPR1 antagonists. Bioorg Med Chem Lett22:532-6 (2011) 
 
Cytochrome P450 1A2
Name:Cytochrome P450 1A2
Type:Enzyme
Mol. Mass.:58423.38
Organism:Homo sapiens (Human)
Description:P05177
Residue:516
BDBM50419562
NameBDBM50419562
Synonyms:CHEMBL1934424
TypeSmall organic molecule
Emp. Form.C25H38N4O4S
Mol. Mass.490.659
SMILESCO[C@H]1CC[C@H](CC1)n1nc(C)c(C(=O)N[C@@H](C)C(C)(C)C)c1NS(=O)(=O)c1ccc(C)cc1