Reaction Details
TargetHistamine H3 receptor
LigandBDBM50419594
Substrate/Competitorn/a
Meas. Tech.ChEMBL_795214 (CHEMBL1936782)
Ki 12882.5±n/a nM
Citation Bordi, FRivara, SDallaturca, ECarmi, CPala, DLodola, AVacondio, FFlammini, LBertoni, SBallabeni, VBarocelli, EMor, M Dibasic biphenyl H3 receptor antagonists: Steric tolerance for a lipophilic side chain. Eur J Med Chem48:214-30 (2012) 
 
Histamine H3 receptor
Name:Histamine H3 receptor
Type:G Protein-Coupled Receptor (GPCR)
Mol. Mass.:48691.47
Organism:Homo sapiens (Human)
Description:Binding assays were using CHO cells stably expressing hH3R receptors.
Residue:445
BDBM50419594
NameBDBM50419594
Synonyms:CHEMBL1934066
TypeSmall organic molecule
Emp. Form.C23H31N
Mol. Mass.321.4989
SMILESCCCCCc1ccc(cc1)-c1ccc(CN2CCCCC2)cc1