Reaction Details
TargetHistamine H3 receptor
LigandBDBM50419598
Substrate/Competitorn/a
Meas. Tech.ChEMBL_795215 (CHEMBL1936874)
Ki 0.372±n/a nM
Citation Bordi, FRivara, SDallaturca, ECarmi, CPala, DLodola, AVacondio, FFlammini, LBertoni, SBallabeni, VBarocelli, EMor, M Dibasic biphenyl H3 receptor antagonists: Steric tolerance for a lipophilic side chain. Eur J Med Chem48:214-30 (2012) 
 
Histamine H3 receptor
Name:Histamine H3 receptor
Type:G Protein-Coupled Receptor (GPCR)
Mol. Mass.:48607.98
Organism:Rattus norvegicus (rat)
Description:n/a
Residue:445
BDBM50419598
NameBDBM50419598
Synonyms:CHEMBL1934049
TypeSmall organic molecule
Emp. Form.C24H32N2
Mol. Mass.348.5243
SMILESC[C@H]1CCCN1Cc1ccc(cc1)-c1ccc(CN2CCCCC2)cc1