Reaction Details
TargetNeuronal acetylcholine receptor subunit alpha-4/beta-2
LigandBDBM50419601
Substrate/Competitorn/a
Meas. Tech.ChEMBL_799990 (CHEMBL1941696)
IC50 6600±n/a nM
Citation Henderson, BJCarper, DJGonzález-Cestari, TFYi, BMahasenan, KPavlovicz, REDalefield, MLColeman, RSLi, CMcKay, DB Structure-activity relationship studies of sulfonylpiperazine analogues as novel negative allosteric modulators of human neuronal nicotinic receptors. J Med Chem54:8681-92 (2011) 
 
Neuronal acetylcholine receptor subunit alpha-4/beta-2
Name:Neuronal acetylcholine receptor subunit alpha-4/beta-2
Type:Protein
Mol. Mass.:n/a
Description:n/a
Components:This complex has 2 components.
Component 1
Name:Neuronal acetylcholine receptor subunit alpha-4
Synonyms:ACHA4_HUMAN CHRNA4 protein Neuronal acetylcholine receptor protein alpha-4 subunit Nicotinic acetylcholine receptor alpha4/beta2/alpha5
Type:n/a
Mol. Mass.:69963.49
Organism:Homo sapiens (Human)
Description:NACHRA4
Residue:627
Component 2
Name:Neuronal acetylcholine receptor subunit beta-2
Synonyms:ACHB2_HUMAN Neuronal acetylcholine receptor protein beta-2 subunit | Nicotinic acetylcholine receptor alpha3/beta2/alpha5
Type:Protein
Mol. Mass.:57020.50
Organism:Homo sapiens (Human)
Description:P17787
Residue:502
BDBM50419601
NameBDBM50419601
Synonyms:CHEMBL1940786
TypeSmall organic molecule
Emp. Form.C19H20FN5O3S
Mol. Mass.417.457
SMILESFc1ccc(cc1)S(=O)(=O)N1CCN(CC(=O)Nc2ccc3[nH]ncc3c2)CC1