Reaction Details
TargetBeta-2 adrenergic receptor
LigandBDBM50419652
Substrate/Competitorn/a
Meas. Tech.ChEMBL_797652 (CHEMBL1943770)
EC50 0.501187±n/a nM
Citation Jacobsen, JRChoi, SKCombs, JFournier, EJKlein, UPfeiffer, JWThomas, GRYu, CMoran, EJ A multivalent approach to the discovery of long-actingß(2)-adrenoceptor agonists for the treatment of asthma and COPD. Bioorg Med Chem Lett22:1213-8 (2012) 
 
Beta-2 adrenergic receptor
Name:Beta-2 adrenergic receptor
Type:n/a
Mol. Mass.:46461.69
Organism:Homo sapiens (Human)
Description:P07550
Residue:413
BDBM50419652
NameBDBM50419652
Synonyms:MILVETEROL
TypeSmall organic molecule
Emp. Form.C25H29N3O4
Mol. Mass.435.5155
SMILESO[C@@H](CNCCc1ccc(NC[C@H](O)c2ccccc2)cc1)c1ccc(O)c(NC=O)c1