Reaction Details
TargetBeta-1 adrenergic receptor
LigandBDBM50419650
Substrate/Competitorn/a
Meas. Tech.ChEMBL_797651 (CHEMBL1943769)
EC50 251±n/a nM
Citation Jacobsen, JRChoi, SKCombs, JFournier, EJKlein, UPfeiffer, JWThomas, GRYu, CMoran, EJ A multivalent approach to the discovery of long-actingß(2)-adrenoceptor agonists for the treatment of asthma and COPD. Bioorg Med Chem Lett22:1213-8 (2012) 
 
Beta-1 adrenergic receptor
Name:Beta-1 adrenergic receptor
Type:G Protein-Coupled Receptor (GPCR)
Mol. Mass.:51338.40
Organism:Homo sapiens (Human)
Description:P08588
Residue:477
BDBM50419650
NameBDBM50419650
Synonyms:CHEMBL1940830
TypeSmall organic molecule
Emp. Form.C25H30N2O4
Mol. Mass.422.5167
SMILESOCc1cc(ccc1O)[C@@H](O)CNCCc1ccc(NC[C@H](O)c2ccccc2)cc1