Reaction Details
TargetBeta-2 adrenergic receptor
LigandBDBM50419671
Substrate/Competitorn/a
Meas. Tech.ChEMBL_800669 (CHEMBL1947791)
IC50 0.794328±n/a nM
Citation Alcaraz, LBailey, ACadogan, EConnolly, SJewell, RJordan, SKindon, NLister, ALawson, MMullen, ADainty, INicholls, DPaine, SPairaudeau, GStocks, MJThorne, PYoung, A From libraries to candidate: the discovery of new ultra long-acting dibasicß2-adrenoceptor agonists. Bioorg Med Chem Lett22:689-95 (2011) 
 
Beta-2 adrenergic receptor
Name:Beta-2 adrenergic receptor
Type:n/a
Mol. Mass.:46461.69
Organism:Homo sapiens (Human)
Description:P07550
Residue:413
BDBM50419671
NameBDBM50419671
Synonyms:CHEMBL1944693
TypeSmall organic molecule
Emp. Form.C27H31N3O4S
Mol. Mass.493.618
SMILESCOc1ccccc1CCNCc1cccc(CCNC[C@H](O)c2ccc(O)c3[nH]c(=O)sc23)c1