Reaction Details
TargetBeta-1 adrenergic receptor
LigandBDBM25771
Substrate/Competitorn/a
Meas. Tech.ChEMBL_800692 (CHEMBL1947814)
IC50 501±n/a nM
Citation Alcaraz, LBailey, ACadogan, EConnolly, SJewell, RJordan, SKindon, NLister, ALawson, MMullen, ADainty, INicholls, DPaine, SPairaudeau, GStocks, MJThorne, PYoung, A From libraries to candidate: the discovery of new ultra long-acting dibasicß2-adrenoceptor agonists. Bioorg Med Chem Lett22:689-95 (2011) 
 
Beta-1 adrenergic receptor
Name:Beta-1 adrenergic receptor
Type:G Protein-Coupled Receptor (GPCR)
Mol. Mass.:51338.40
Organism:Homo sapiens (Human)
Description:P08588
Residue:477
BDBM25771
NameBDBM25771
Synonyms:1-hydroxy-2-naphthoic acid;4-[1-hydroxy-2-[6-(4-phenylbutoxy)hexylamino]ethyl]-2-methylol-phenol Aeromax Serevent | salmeterol xinafoate
TypeSmall organic molecule
Emp. Form.C25H37NO4
Mol. Mass.415.5656
SMILESOCc1cc(ccc1O)C(O)CNCCCCCCOCCCCc1ccccc1