Reaction Details
TargetBeta-1 adrenergic receptor
LigandBDBM50419706
Substrate/Competitorn/a
Meas. Tech.ChEMBL_800670 (CHEMBL1947792)
IC50 7.9±n/a nM
Citation Alcaraz, LBailey, ACadogan, EConnolly, SJewell, RJordan, SKindon, NLister, ALawson, MMullen, ADainty, INicholls, DPaine, SPairaudeau, GStocks, MJThorne, PYoung, A From libraries to candidate: the discovery of new ultra long-acting dibasicß2-adrenoceptor agonists. Bioorg Med Chem Lett22:689-95 (2011) 
 
Beta-1 adrenergic receptor
Name:Beta-1 adrenergic receptor
Type:G Protein-Coupled Receptor (GPCR)
Mol. Mass.:51338.40
Organism:Homo sapiens (Human)
Description:P08588
Residue:477
BDBM50419706
NameBDBM50419706
Synonyms:CHEMBL1945296
TypeSmall organic molecule
Emp. Form.C27H29Cl2N3O3S
Mol. Mass.546.508
SMILESO[C@@H](CNCCCc1cccc(CNCCc2c(Cl)cccc2Cl)c1)c1ccc(O)c2[nH]c(=O)sc12