Reaction Details
Target5-hydroxytryptamine receptor 1A
LigandBDBM50409811
Substrate/Competitorn/a
Meas. Tech.ChEMBL_800456 (CHEMBL1948477)
Ki 0.603±n/a nM
Citation Prandi, AFranchini, SManasieva, LIFossa, PCichero, EMarucci, GBuccioni, MCilia, APirona, LBrasili, L Synthesis, biological evaluation, and docking studies of tetrahydrofuran- cyclopentanone- and cyclopentanol-based ligands acting at adrenergica1- and serotonine 5-HT1A receptors. J Med Chem55:23-36 (2012) 
 
5-hydroxytryptamine receptor 1A
Name:5-hydroxytryptamine receptor 1A
Type:n/a
Mol. Mass.:46122.49
Organism:Homo sapiens (Human)
Description:n/a
Residue:422
BDBM50409811
NameBDBM50409811
Synonyms:CHEMBL1082862 | CHEMBL286003
TypeSmall organic molecule
Emp. Form.C25H27NO4
Mol. Mass.405.4862
SMILESCOc1ccccc1OCCNCC1COC(O1)(c1ccccc1)c1ccccc1