Reaction Details
Target5-hydroxytryptamine receptor 1A
LigandBDBM50419711
Substrate/Competitorn/a
Meas. Tech.ChEMBL_800456 (CHEMBL1948477)
Ki 3.47±n/a nM
Citation Prandi, AFranchini, SManasieva, LIFossa, PCichero, EMarucci, GBuccioni, MCilia, APirona, LBrasili, L Synthesis, biological evaluation, and docking studies of tetrahydrofuran- cyclopentanone- and cyclopentanol-based ligands acting at adrenergica1- and serotonine 5-HT1A receptors. J Med Chem55:23-36 (2012) 
 
5-hydroxytryptamine receptor 1A
Name:5-hydroxytryptamine receptor 1A
Type:n/a
Mol. Mass.:46122.49
Organism:Homo sapiens (Human)
Description:n/a
Residue:422
BDBM50419711
NameBDBM50419711
Synonyms:CHEMBL1946783
TypeSmall organic molecule
Emp. Form.C29H32N2O2
Mol. Mass.440.5766
SMILESCOc1ccccc1N1CCN(CC2CCC(C2=O)(c2ccccc2)c2ccccc2)CC1