Reaction Details
TargetAlpha-1A adrenergic receptor
LigandBDBM50419718
Substrate/Competitorn/a
Meas. Tech.ChEMBL_800453 (CHEMBL1948474)
Ki 0.646±n/a nM
Citation Prandi, AFranchini, SManasieva, LIFossa, PCichero, EMarucci, GBuccioni, MCilia, APirona, LBrasili, L Synthesis, biological evaluation, and docking studies of tetrahydrofuran- cyclopentanone- and cyclopentanol-based ligands acting at adrenergica1- and serotonine 5-HT1A receptors. J Med Chem55:23-36 (2012) 
 
Alpha-1A adrenergic receptor
Name:Alpha-1A adrenergic receptor
Type:Cell-surface receptors
Mol. Mass.:51511.67
Organism:Homo sapiens (Human)
Description:P35348
Residue:466
BDBM50419718
NameBDBM50419718
Synonyms:CHEMBL1946780
TypeSmall organic molecule
Emp. Form.C28H32N2O2
Mol. Mass.428.5659
SMILESCOc1ccccc1N1CCN(CC2CCC(O2)(c2ccccc2)c2ccccc2)CC1