Reaction Details
TargetAlpha-1B adrenergic receptor
LigandBDBM50419717
Substrate/Competitorn/a
Meas. Tech.ChEMBL_800454 (CHEMBL1948475)
Ki 123.03±n/a nM
Citation Prandi, AFranchini, SManasieva, LIFossa, PCichero, EMarucci, GBuccioni, MCilia, APirona, LBrasili, L Synthesis, biological evaluation, and docking studies of tetrahydrofuran- cyclopentanone- and cyclopentanol-based ligands acting at adrenergica1- and serotonine 5-HT1A receptors. J Med Chem55:23-36 (2012) 
 
Alpha-1B adrenergic receptor
Name:Alpha-1B adrenergic receptor
Type:Enzyme
Mol. Mass.:56862.13
Organism:Homo sapiens (Human)
Description:P35368
Residue:520
BDBM50419717
NameBDBM50419717
Synonyms:CHEMBL1946778
TypeSmall organic molecule
Emp. Form.C25H27NO2
Mol. Mass.373.4874
SMILESC(COc1ccccc1)NCC1CCC(O1)(c1ccccc1)c1ccccc1