Reaction Details
TargetAlpha-1B adrenergic receptor
LigandBDBM50419713
Substrate/Competitorn/a
Meas. Tech.ChEMBL_800454 (CHEMBL1948475)
Ki 74.13±n/a nM
Citation Prandi, AFranchini, SManasieva, LIFossa, PCichero, EMarucci, GBuccioni, MCilia, APirona, LBrasili, L Synthesis, biological evaluation, and docking studies of tetrahydrofuran- cyclopentanone- and cyclopentanol-based ligands acting at adrenergica1- and serotonine 5-HT1A receptors. J Med Chem55:23-36 (2012) 
 
Alpha-1B adrenergic receptor
Name:Alpha-1B adrenergic receptor
Type:Enzyme
Mol. Mass.:56862.13
Organism:Homo sapiens (Human)
Description:P35368
Residue:520
BDBM50419713
NameBDBM50419713
Synonyms:CHEMBL1946786
TypeSmall organic molecule
Emp. Form.C27H31NO3
Mol. Mass.417.5399
SMILESCOc1ccccc1OCCNC[C@H]1CCC([C@@H]1O)(c1ccccc1)c1ccccc1