Reaction Details
Target5-hydroxytryptamine receptor 1A
LigandBDBM50419712
Substrate/Competitorn/a
Meas. Tech.ChEMBL_800456 (CHEMBL1948477)
Ki 9.33±n/a nM
Citation Prandi, AFranchini, SManasieva, LIFossa, PCichero, EMarucci, GBuccioni, MCilia, APirona, LBrasili, L Synthesis, biological evaluation, and docking studies of tetrahydrofuran- cyclopentanone- and cyclopentanol-based ligands acting at adrenergica1- and serotonine 5-HT1A receptors. J Med Chem55:23-36 (2012) 
 
5-hydroxytryptamine receptor 1A
Name:5-hydroxytryptamine receptor 1A
Type:n/a
Mol. Mass.:46122.49
Organism:Homo sapiens (Human)
Description:n/a
Residue:422
BDBM50419712
NameBDBM50419712
Synonyms:CHEMBL1946784
TypeSmall organic molecule
Emp. Form.C26H29NO2
Mol. Mass.387.514
SMILESO[C@@H]1[C@H](CNCCOc2ccccc2)CCC1(c1ccccc1)c1ccccc1