Reaction Details
TargetAcetylcholine-binding protein
LigandBDBM50080818
Substrate/Competitorn/a
Meas. Tech.ChEMBL_801486 (CHEMBL1948413)
Ki 630.96±n/a nM
Citation Edink, EAkdemir, AJansen, Cvan Elk, RZuiderveld, Ode Kanter, FJvan Muijlwijk-Koezen, JESmit, ABLeurs, Rde Esch, IJ Structure-based design, synthesis and structure-activity relationships of dibenzosuberyl- and benzoate-substituted tropines as ligands for acetylcholine-binding protein. Bioorg Med Chem Lett22:1448-54 (2012) 
 
Acetylcholine-binding protein
Name:Acetylcholine-binding protein
Type:n/a
Mol. Mass.:26055.52
Organism:Lymnaea stagnalis
Description:Soluble acetylcholine receptor
Residue:229
BDBM50080818
NameBDBM50080818
Synonyms:(-)-lobeline 2-(6-(beta-Hydroxyphenethyl)-1-methyl-2-piperidyl)acetophenone 8,10-Diphenyllobelionol Lobelin alpha-Lobeline
TypeSmall organic molecule
Emp. Form.C22H27NO2
Mol. Mass.337.4553
SMILESCN1[C@H](C[C@H](O)c2ccccc2)CCC[C@@H]1CC(=O)c1ccccc1