Reaction Details
TargetAcetylcholine-binding protein
LigandBDBM50419740
Substrate/Competitorn/a
Meas. Tech.ChEMBL_801486 (CHEMBL1948413)
Ki 39.81±n/a nM
Citation Edink, EAkdemir, AJansen, Cvan Elk, RZuiderveld, Ode Kanter, FJvan Muijlwijk-Koezen, JESmit, ABLeurs, Rde Esch, IJ Structure-based design, synthesis and structure-activity relationships of dibenzosuberyl- and benzoate-substituted tropines as ligands for acetylcholine-binding protein. Bioorg Med Chem Lett22:1448-54 (2012) 
 
Acetylcholine-binding protein
Name:Acetylcholine-binding protein
Type:n/a
Mol. Mass.:26055.52
Organism:Lymnaea stagnalis
Description:Soluble acetylcholine receptor
Residue:229
BDBM50419740
NameBDBM50419740
Synonyms:CHEMBL1946189
TypeSmall organic molecule
Emp. Form.C31H36NO
Mol. Mass.438.6231
SMILESC[N+]1(CCc2ccccc2)[C@H]2CC[C@@H]1C[C@@H](C2)OC1c2ccccc2CCc2ccccc12