Reaction Details
TargetAcetylcholine-binding protein
LigandBDBM50419735
Substrate/Competitorn/a
Meas. Tech.ChEMBL_801486 (CHEMBL1948413)
Ki 125.89±n/a nM
Citation Edink, EAkdemir, AJansen, Cvan Elk, RZuiderveld, Ode Kanter, FJvan Muijlwijk-Koezen, JESmit, ABLeurs, Rde Esch, IJ Structure-based design, synthesis and structure-activity relationships of dibenzosuberyl- and benzoate-substituted tropines as ligands for acetylcholine-binding protein. Bioorg Med Chem Lett22:1448-54 (2012) 
 
Acetylcholine-binding protein
Name:Acetylcholine-binding protein
Type:n/a
Mol. Mass.:26055.52
Organism:Lymnaea stagnalis
Description:Soluble acetylcholine receptor
Residue:229
BDBM50419735
NameBDBM50419735
Synonyms:CHEMBL1947059
TypeSmall organic molecule
Emp. Form.C23H28NO3
Mol. Mass.366.4728
SMILESC[N+]1(CC(O)c2ccccc2)[C@H]2CC[C@@H]1C[C@@H](C2)OC(=O)c1ccccc1