Reaction Details
TargetSoluble acetylcholine receptor
LigandBDBM50419734
Substrate/Competitorn/a
Meas. Tech.ChEMBL_801487 (CHEMBL1948414)
Ki 158.49±n/a nM
Citation Edink, EAkdemir, AJansen, Cvan Elk, RZuiderveld, Ode Kanter, FJvan Muijlwijk-Koezen, JESmit, ABLeurs, Rde Esch, IJ Structure-based design, synthesis and structure-activity relationships of dibenzosuberyl- and benzoate-substituted tropines as ligands for acetylcholine-binding protein. Bioorg Med Chem Lett22:1448-54 (2012) 
 
Soluble acetylcholine receptor
Name:Soluble acetylcholine receptor
Type:n/a
Mol. Mass.:26560.08
Organism:Aplysia Californica
Description:Q8WSF8
Residue:236
BDBM50419734
NameBDBM50419734
Synonyms:CHEMBL1947056
TypeSmall organic molecule
Emp. Form.C22H25NO3
Mol. Mass.351.4388
SMILESOC(CN1[C@H]2CC[C@@H]1C[C@@H](C2)OC(=O)c1ccccc1)c1ccccc1