Reaction Details
TargetAcetylcholine-binding protein
LigandBDBM82070
Substrate/Competitorn/a
Meas. Tech.ChEMBL_801486 (CHEMBL1948413)
Ki 316.23±n/a nM
Citation Edink, EAkdemir, AJansen, Cvan Elk, RZuiderveld, Ode Kanter, FJvan Muijlwijk-Koezen, JESmit, ABLeurs, Rde Esch, IJ Structure-based design, synthesis and structure-activity relationships of dibenzosuberyl- and benzoate-substituted tropines as ligands for acetylcholine-binding protein. Bioorg Med Chem Lett22:1448-54 (2012) 
 
Acetylcholine-binding protein
Name:Acetylcholine-binding protein
Type:n/a
Mol. Mass.:26055.52
Organism:Lymnaea stagnalis
Description:Soluble acetylcholine receptor
Residue:229
BDBM82070
NameBDBM82070
Synonyms:CAS_29790-52-1 Nicotine-D salicylate US9303017, Nicotine
Typen/a
Emp. Form.C10H14N2
Mol. Mass.162.2316
SMILESCN1CCC[C@H]1c1cccnc1