Reaction Details
TargetAlpha-2B adrenergic receptor
LigandBDBM50419890
Substrate/Competitorn/a
Meas. Tech.ChEMBL_805962 (CHEMBL1960290)
EC50 162±n/a nM
Citation Diamanti, EDel Bello, FCarbonara, GCarrieri, AFracchiolla, GGiannella, MMammoli, VPiergentili, APohjanoksa, KQuaglia, WScheinin, MPigini, M Might the observeda(2A)-adrenoreceptor agonism or antagonism of allyphenyline analogues be ascribed to different molecular conformations? Bioorg Med Chem20:2082-90 (2012) 
 
Alpha-2B adrenergic receptor
Name:Alpha-2B adrenergic receptor
Type:Enzyme
Mol. Mass.:49964.20
Organism:Homo sapiens (Human)
Description:P18089
Residue:450
BDBM50419890
NameBDBM50419890
Synonyms:CHEMBL1956191
TypeSmall organic molecule
Emp. Form.C11H13ClN2O
Mol. Mass.224.687
SMILESCC(Oc1ccccc1Cl)C1=NCCN1