Reaction Details
TargetAlpha-2A adrenergic receptor
LigandBDBM50419889
Substrate/Competitorn/a
Meas. Tech.ChEMBL_805961 (CHEMBL1960289)
EC50 19±n/a nM
Citation Diamanti, EDel Bello, FCarbonara, GCarrieri, AFracchiolla, GGiannella, MMammoli, VPiergentili, APohjanoksa, KQuaglia, WScheinin, MPigini, M Might the observeda(2A)-adrenoreceptor agonism or antagonism of allyphenyline analogues be ascribed to different molecular conformations? Bioorg Med Chem20:2082-90 (2012) 
 
Alpha-2A adrenergic receptor
Name:Alpha-2A adrenergic receptor
Type:Enzyme
Mol. Mass.:48979.91
Organism:Homo sapiens (Human)
Description:P08913
Residue:450
BDBM50419889
NameBDBM50419889
Synonyms:CHEMBL155866
TypeSmall organic molecule
Emp. Form.C13H18N2O
Mol. Mass.218.2948
SMILESCC(Oc1c(C)cccc1C)C1=NCCN1