Reaction Details
TargetB2 bradykinin receptor
LigandBDBM50419909
Substrate/Competitorn/a
Meas. Tech.ChEMBL_806221 (CHEMBL1958762)
Ki 0.0631±n/a nM
Citation Fincham, CIBressan, AD'Andrea, PEttorre, AGiuliani, SMauro, SMeini, SParis, MQuartara, LRossi, CSquarcia, AValenti, CDaniela, FMaggi, CA Design and synthesis of novel sulfonamide-containing bradykinin hB(2) receptor antagonists. Synthesis and structure-relationships ofa,a-tetrahydropyranylglycine. Bioorg Med Chem20:2091-100 (2012) 
 
B2 bradykinin receptor
Name:B2 bradykinin receptor
Type:Enzyme Catalytic Domain
Mol. Mass.:44467.17
Organism:Homo sapiens (Human)
Description:B2 BRADYKININ BDKRB2 HUMAN::P30411
Residue:391
BDBM50419909
NameBDBM50419909
Synonyms:CHEMBL1956858
TypeSmall organic molecule
Emp. Form.C36H48Cl2N6O6S
Mol. Mass.763.774
SMILESCN(C)CCCC[C@H](N)C(=O)N1CCN(CC1)C(=O)C1(CCOCC1)NS(=O)(=O)c1ccc(Cl)c(COc2cccc3c(C)cc(C)nc23)c1Cl