Reaction Details
TargetB2 bradykinin receptor
LigandBDBM50419893
Substrate/Competitorn/a
Meas. Tech.ChEMBL_806221 (CHEMBL1958762)
Ki 0.316±n/a nM
Citation Fincham, CIBressan, AD'Andrea, PEttorre, AGiuliani, SMauro, SMeini, SParis, MQuartara, LRossi, CSquarcia, AValenti, CDaniela, FMaggi, CA Design and synthesis of novel sulfonamide-containing bradykinin hB(2) receptor antagonists. Synthesis and structure-relationships ofa,a-tetrahydropyranylglycine. Bioorg Med Chem20:2091-100 (2012) 
 
B2 bradykinin receptor
Name:B2 bradykinin receptor
Type:Enzyme Catalytic Domain
Mol. Mass.:44467.17
Organism:Homo sapiens (Human)
Description:B2 BRADYKININ BDKRB2 HUMAN::P30411
Residue:391
BDBM50419893
NameBDBM50419893
Synonyms:CHEMBL1956869
TypeSmall organic molecule
Emp. Form.C34H46Cl2N5O5S
Mol. Mass.707.73
SMILESCc1cc(C)c2cccc(OCc3c(Cl)ccc(c3Cl)S(=O)(=O)NC3(CCOCC3)C(=O)N3CCN(CCC[N+](C)(C)C)CC3)c2n1