Reaction Details
TargetAlpha-2C adrenergic receptor
LigandBDBM50019848
Substrate/Competitorn/a
Meas. Tech.ChEMBL_807924 (CHEMBL1959307)
Ki 18±n/a nM
Citation Mammoli, VBonifazi, ADel Bello, FDiamanti, EGiannella, MHudson, ALMattioli, LPerfumi, MPiergentili, AQuaglia, WTitomanlio, FPigini, M Favourable involvement ofa2A-adrenoreceptor antagonism in the I2-imidazoline binding sites-mediated morphine analgesia enhancement. Bioorg Med Chem20:2259-65 (2012) 
 
Alpha-2C adrenergic receptor
Name:Alpha-2C adrenergic receptor
Type:Enzyme
Mol. Mass.:49552.32
Organism:Homo sapiens (Human)
Description:P18825
Residue:462
BDBM50019848
NameBDBM50019848
Synonyms:2-(2,3-dihydro-1,4-benzodioxin-2-yl)-4,5-dihydro-1H-imidazole CHEMBL10316 US8633208, Idazoxan
TypeSmall organic molecule
Emp. Form.C11H12N2O2
Mol. Mass.204.2252
SMILESC1CN=C(N1)C1COc2ccccc2O1