Reaction Details
TargetSphingosine 1-phosphate receptor 1
LigandBDBM50419987
Substrate/Competitorn/a
Meas. Tech.ChEMBL_813766 (CHEMBL2020024)
EC50 1258.93±n/a nM
Citation Meng, QZhao, BXu, QXu, XDeng, GLi, CLuan, LRen, FWang, HXu, HXu, YZhang, HXiang, JNElliott, JDGuo, TBZhao, YZhang, WLu, HLin, X Indole-propionic acid derivatives as potent, S1P3-sparing and EAE efficacious sphingosine-1-phosphate 1 (S1P1) receptor agonists. Bioorg Med Chem Lett22:2794-7 (2012) 
 
Sphingosine 1-phosphate receptor 1
Name:Sphingosine 1-phosphate receptor 1
Type:Enzyme
Mol. Mass.:42836.02
Organism:Homo sapiens (Human)
Description:P21453
Residue:382
BDBM50419987
NameBDBM50419987
Synonyms:CHEMBL2018310
TypeSmall organic molecule
Emp. Form.C21H19N3O5
Mol. Mass.393.3927
SMILESCOc1ccc(cc1OC)-c1nc(no1)-c1cccc2c(CCC(O)=O)c[nH]c12