Reaction Details
TargetSphingosine 1-phosphate receptor 1
LigandBDBM50419992
Substrate/Competitorn/a
Meas. Tech.ChEMBL_813766 (CHEMBL2020024)
EC50 5.01±n/a nM
Citation Meng, QZhao, BXu, QXu, XDeng, GLi, CLuan, LRen, FWang, HXu, HXu, YZhang, HXiang, JNElliott, JDGuo, TBZhao, YZhang, WLu, HLin, X Indole-propionic acid derivatives as potent, S1P3-sparing and EAE efficacious sphingosine-1-phosphate 1 (S1P1) receptor agonists. Bioorg Med Chem Lett22:2794-7 (2012) 
 
Sphingosine 1-phosphate receptor 1
Name:Sphingosine 1-phosphate receptor 1
Type:Enzyme
Mol. Mass.:42836.02
Organism:Homo sapiens (Human)
Description:P21453
Residue:382
BDBM50419992
NameBDBM50419992
Synonyms:CHEMBL2018316
TypeSmall organic molecule
Emp. Form.C20H16ClN3O4
Mol. Mass.397.812
SMILESCC(C)Oc1ccc(cc1Cl)-c1nc(no1)-c1cccc2c(c[nH]c12)C(O)=O