Reaction Details
TargetSphingosine 1-phosphate receptor 1
LigandBDBM50419997
Substrate/Competitorn/a
Meas. Tech.ChEMBL_813766 (CHEMBL2020024)
EC50 0.0398±n/a nM
Citation Meng, QZhao, BXu, QXu, XDeng, GLi, CLuan, LRen, FWang, HXu, HXu, YZhang, HXiang, JNElliott, JDGuo, TBZhao, YZhang, WLu, HLin, X Indole-propionic acid derivatives as potent, S1P3-sparing and EAE efficacious sphingosine-1-phosphate 1 (S1P1) receptor agonists. Bioorg Med Chem Lett22:2794-7 (2012) 
 
Sphingosine 1-phosphate receptor 1
Name:Sphingosine 1-phosphate receptor 1
Type:Enzyme
Mol. Mass.:42836.02
Organism:Homo sapiens (Human)
Description:P21453
Residue:382
BDBM50419997
NameBDBM50419997
Synonyms:CHEMBL2018321
TypeSmall organic molecule
Emp. Form.C23H23ClN4O3
Mol. Mass.438.907
SMILESCNC(=O)CCc1c[nH]c2c(cccc12)-c1noc(n1)-c1ccc(OC(C)C)c(Cl)c1