Reaction Details
TargetSphingosine 1-phosphate receptor 1
LigandBDBM50420002
Substrate/Competitorn/a
Meas. Tech.ChEMBL_813766 (CHEMBL2020024)
EC50 6.31±n/a nM
Citation Meng, QZhao, BXu, QXu, XDeng, GLi, CLuan, LRen, FWang, HXu, HXu, YZhang, HXiang, JNElliott, JDGuo, TBZhao, YZhang, WLu, HLin, X Indole-propionic acid derivatives as potent, S1P3-sparing and EAE efficacious sphingosine-1-phosphate 1 (S1P1) receptor agonists. Bioorg Med Chem Lett22:2794-7 (2012) 
 
Sphingosine 1-phosphate receptor 1
Name:Sphingosine 1-phosphate receptor 1
Type:Enzyme
Mol. Mass.:42836.02
Organism:Homo sapiens (Human)
Description:P21453
Residue:382
BDBM50420002
NameBDBM50420002
Synonyms:CHEMBL2018327
TypeSmall organic molecule
Emp. Form.C24H24ClN3O5
Mol. Mass.469.917
SMILESCOc1ccc(-c2noc(n2)-c2ccc(OC(C)C)c(Cl)c2)c2n(C)cc(CCC(O)=O)c12