Reaction Details
TargetSphingosine 1-phosphate receptor 3
LigandBDBM50419983
Substrate/Competitorn/a
Meas. Tech.ChEMBL_813767 (CHEMBL2020025)
EC50>10000±n/a nM
Citation Meng, QZhao, BXu, QXu, XDeng, GLi, CLuan, LRen, FWang, HXu, HXu, YZhang, HXiang, JNElliott, JDGuo, TBZhao, YZhang, WLu, HLin, X Indole-propionic acid derivatives as potent, S1P3-sparing and EAE efficacious sphingosine-1-phosphate 1 (S1P1) receptor agonists. Bioorg Med Chem Lett22:2794-7 (2012) 
 
Sphingosine 1-phosphate receptor 3
Name:Sphingosine 1-phosphate receptor 3
Type:G Protein-Coupled Receptor (GPCR)
Mol. Mass.:42278.13
Organism:Homo sapiens (Human)
Description:Q99500
Residue:378
BDBM50419983
NameBDBM50419983
Synonyms:CHEMBL2018306
TypeSmall organic molecule
Emp. Form.C22H19F3N4O4
Mol. Mass.460.4059
SMILESCC(C)Oc1ncc(cc1C(F)(F)F)-c1nc(no1)-c1cccc2c(CCC(O)=O)c[nH]c12