Reaction Details
TargetSolute carrier organic anion transporter family member 1A4
LigandBDBM50367247
Substrate/Competitorn/a
Meas. Tech.ChEMBL_836632 (CHEMBL2077474)
Ki 3810±n/a nM
Citation Shitara, YSugiyama, DKusuhara, HKato, YAbe, TMeier, PJItoh, TSugiyama, Y Comparative inhibitory effects of different compounds on rat oatpl (slc21a1)- and Oatp2 (Slc21a5)-mediated transport. Pharm Res19:147-53 (2002) Solute carrier organic anion transporter family member 1A4
Name:Solute carrier organic anion transporter family member 1A4
Type:PROTEIN
Mol. Mass.:73261.82
Organism:Rattus norvegicus
Description:ChEMBL_836631
Residue:661
BDBM50367247
NameBDBM50367247
Synonyms:QUININE Quinsan | cid_3034034
TypeSmall organic molecule
Emp. Form.C20H24N2O2
Mol. Mass.324.4168
SMILESCOc1ccc2nccc([C@@H](O)[C@@H]3C[C@@H]4CCN3C[C@@H]4C=C)c2c1