Reaction Details
TargetSolute carrier family 22 member 2
LigandBDBM50017674
Substrate/Competitorn/a
Meas. Tech.ChEMBL_838484 (CHEMBL2076055)
IC50 32000±n/a nM
Citation Urakami, YOkuda, MMasuda, SAkazawa, MSaito, HInui, K Distinct characteristics of organic cation transporters, OCT1 and OCT2, in the basolateral membrane of renal tubules. Pharm Res18:1528-34 (2001) Solute carrier family 22 member 2
Name:Solute carrier family 22 member 2
Type:Enzyme Catalytic Domain
Mol. Mass.:62348.38
Organism:RAT
Description:Adrenaline alpha2 0 RAT::Q9R0W2
Residue:555
BDBM50017674
NameBDBM50017674
Synonyms:(2-Benzhydryloxy-ethyl)-dimethyl-amine 2-(diphenylmethoxy)-N,N-dimethylethanamine Beldin Benadryl CHEMBL657 DIPHENHYDRAMINE Diphen N-[2-(BENZHYDRYLOXY)ETHYL]-N,N-DIMETHYLAMINE US9138431, DIPHENHYDRAMINE (Benadryl) | US9333199, DIPHENHYDRAMINE (Benadryl)
TypeSmall organic molecule
Emp. Form.C17H21NO
Mol. Mass.255.3547
SMILESCN(C)CCOC(c1ccccc1)c1ccccc1