Reaction Details
TargetSolute carrier family 22 member 1
LigandBDBM16173
Substrate/Competitorn/a
Meas. Tech.ChEMBL_838514 (CHEMBL2078142)
Ki 6900±n/a nM
Citation Urakami, YOkuda, MMasuda, SAkazawa, MSaito, HInui, K Distinct characteristics of organic cation transporters, OCT1 and OCT2, in the basolateral membrane of renal tubules. Pharm Res18:1528-34 (2001) Solute carrier family 22 member 1
Name:Solute carrier family 22 member 1
Type:Enzyme Catalytic Domain
Mol. Mass.:61538.40
Organism:RAT
Description:Adrenaline alpha1 0 RAT::Q63089
Residue:556
BDBM16173
NameBDBM16173
Synonyms:3,5-diamino-6-chloro-N-(diaminomethylene)pyrazinamide;hydrochloride Amiloride CHEMBL945
TypeSmall organic molecule
Emp. Form.C6H8ClN7O
Mol. Mass.229.627
SMILESNC(=N)NC(=O)c1nc(Cl)c(N)nc1N