Reaction Details
TargetSolute carrier family 22 member 6
LigandBDBM50344965
Substrate/Competitorn/a
Meas. Tech.ChEMBL_836287 (CHEMBL2076300)
Ki 39500±n/a nM
Citation Uwai, YSaito, HHashimoto, YInui, K Inhibitory effect of anti-diabetic agents on rat organic anion transporter rOAT1. Eur J Pharmacol398:193-7 (2000) Solute carrier family 22 member 6
Name:Solute carrier family 22 member 6
Type:PROTEIN
Mol. Mass.:60784.17
Organism:Rattus norvegicus
Description:ChEMBL_838479
Residue:551
BDBM50344965
NameBDBM50344965
Synonyms:1-(4-chlorophenylsulfonyl)-3-propylurea 4-chloro-N-[(propylamino)carbonyl]benzenesulfonamide CHLORPROPAMIDE Glucamide
TypeSmall organic molecule
Emp. Form.C10H13ClN2O3S
Mol. Mass.276.74
SMILESCCCNC(=O)NS(=O)(=O)c1ccc(Cl)cc1