Reaction Details
TargetSolute carrier family 22 member 6
LigandBDBM26193
Substrate/Competitorn/a
Meas. Tech.ChEMBL_835926 (CHEMBL2077064)
Ki 1000000±n/a nM
Citation Uwai, YSaito, HInui, K Interaction between methotrexate and nonsteroidal anti-inflammatory drugs in organic anion transporter. Eur J Pharmacol409:31-6 (2001) Solute carrier family 22 member 6
Name:Solute carrier family 22 member 6
Type:PROTEIN
Mol. Mass.:60784.17
Organism:Rattus norvegicus
Description:ChEMBL_838479
Residue:551
BDBM26193
NameBDBM26193
Synonyms:2-Hydroxybenzoate, I CHEMBL424 salicylic acid
TypeSmall organic molecule
Emp. Form.C7H6O3
Mol. Mass.138.1207
SMILESOC(=O)c1ccccc1O