Reaction Details
TargetATP-binding cassette sub-family C member 2
LigandBDBM50420182
Substrate/Competitorn/a
Meas. Tech.ChEMBL_836120 (CHEMBL2077556)
Ki 3700±n/a nM
Citation Chen, ZSKawabe, TOno, MAoki, SSumizawa, TFurukawa, TUchiumi, TWada, MKuwano, MAkiyama, SI Effect of multidrug resistance-reversing agents on transporting activity of human canalicular multispecific organic anion transporter. Mol Pharmacol56:1219-28 (1999) ATP-binding cassette sub-family C member 2
Name:ATP-binding cassette sub-family C member 2
Type:Protein
Mol. Mass.:174229.45
Organism:Homo sapiens (Human)
Description:Q92887
Residue:1545
BDBM50420182
NameBDBM50420182
Synonyms:CHEMBL2074650
TypeSmall organic molecule
Emp. Form.C38H43N4O7P
Mol. Mass.698.7444
SMILESC[C@@H]1C[C@@H](C)OP(=O)(O1)c1c(C)nc(C)c(C(=O)OCCN2CCN(CC2)C(c2ccccc2)c2ccccc2)c1-c1cccc(c1)[N+]([O-])=O