Reaction Details
TargetSolute carrier family 22 member 6
LigandBDBM50420185
Substrate/Competitorn/a
Meas. Tech.ChEMBL_836539 (CHEMBL2077176)
Ki 22700±n/a nM
Citation Enomoto, ATakeda, MTaki, KTakayama, FNoshiro, RNiwa, TEndou, H Interactions of human organic anion as well as cation transporters with indoxyl sulfate. Eur J Pharmacol466:13-20 (2003) Solute carrier family 22 member 6
Name:Solute carrier family 22 member 6
Type:PROTEIN
Mol. Mass.:61831.78
Organism:Homo sapiens (Human)
Description:ChEMBL_1487359
Residue:563
BDBM50420185
NameBDBM50420185
Synonyms:CHEMBL1233636
TypeSmall organic molecule
Emp. Form.C8H7NO4S
Mol. Mass.213.21
SMILESOS(=O)(=O)Oc1c[nH]c2ccccc12