Reaction Details
TargetSolute carrier family 22 member 11
LigandBDBM50003019
Substrate/Competitorn/a
Meas. Tech.ChEMBL_836434 (CHEMBL2076874)
Ki 20700±n/a nM
Citation Enomoto, ATakeda, MShimoda, MNarikawa, SKobayashi, YKobayashi, YYamamoto, TSekine, TCha, SHNiwa, TEndou, H Interaction of human organic anion transporters 2 and 4 with organic anion transport inhibitors. J Pharmacol Exp Ther301:797-802 (2002) Solute carrier family 22 member 11
Name:Solute carrier family 22 member 11
Type:PROTEIN
Mol. Mass.:59982.54
Organism:Homo sapiens (Human)
Description:ChEMBL_838708
Residue:550
BDBM50003019
NameBDBM50003019
Synonyms:8-(Hexahydro-2,5-methano-pentalen-3a-yl)-1,3-dipropyl-3,7-dihydro-purine-2,6-dione KW-3902
TypeSmall organic molecule
Emp. Form.C20H28N4O2
Mol. Mass.356.4619
SMILESCCCn1c2nc([nH]c2c(=O)n(CCC)c1=O)C12CC3CC1CC(C2)C3