Reaction Details
TargetSolute carrier family 15 member 1
LigandBDBM50188516
Substrate/Competitorn/a
Meas. Tech.ChEMBL_837112 (CHEMBL2076364)
Ki 12800000±n/a nM
Citation Guo, AHu, PBalimane, PVLeibach, FHSinko, PJ Interactions of a nonpeptidic drug, valacyclovir, with the human intestinal peptide transporter (hPEPT1) expressed in a mammalian cell line. J Pharmacol Exp Ther289:448-54 (1999) Solute carrier family 15 member 1
Name:Solute carrier family 15 member 1
Type:PROTEIN
Mol. Mass.:78818.07
Organism:Homo sapiens (Human)
Description:ChEMBL_1488839
Residue:708
BDBM50188516
NameBDBM50188516
Synonyms:2-(2-amino-N-methylacetamido)acetic acid Gly-Sar [(2-Amino-acetyl)-methyl-amino]-acetic acid | [(ammonioacetyl)(methyl)amino]acetate
TypeSmall organic molecule
Emp. Form.C5H10N2O3
Mol. Mass.146.1445
SMILESCN(CC(O)=O)C(=O)CN