Reaction Details
TargetMultidrug resistance-associated protein 1
LigandBDBM50409816
Substrate/Competitorn/a
Meas. Tech.ChEMBL_837127 (CHEMBL2076528)
IC50 9000±n/a nM
Citation Lespine, ADupuy, JOrlowski, SNagy, TGlavinas, HKrajcsi, PAlvinerie, M Interaction of ivermectin with multidrug resistance proteins (MRP1, 2 and 3). Chem Biol Interact159:169-79 (2006) 
 
Multidrug resistance-associated protein 1
Name:Multidrug resistance-associated protein 1
Type:n/a
Mol. Mass.:171597.72
Organism:Homo sapiens (Human)
Description:P33527
Residue:1531
BDBM50409816
NameBDBM50409816
Synonyms:ABAMECTIN
TypeSmall organic molecule
Emp. Form.C48H74O14
Mol. Mass.875.0928
SMILESCC[C@H](C)[C@H]1O[C@]2(CC[C@@H]1C)C[C@@H]1C[C@@H](C\C=C(C)\[C@@H](O[C@H]3C[C@H](OC)[C@@H](O[C@H]4C[C@H](OC)[C@@H](O)[C@H](C)O4)[C@H](C)O3)[C@@H](C)\C=C\C=C3/CO[C@@H]4[C@H](O)C(C)=C[C@@H](C(=O)O1)[C@]34O)O2