Reaction Details
TargetSolute carrier family 22 member 6
LigandBDBM50022271
Substrate/Competitorn/a
Meas. Tech.ChEMBL_838299 (CHEMBL2076247)
IC50 1300±n/a nM
Citation Mulato, ASHo, ESCihlar, T Nonsteroidal anti-inflammatory drugs efficiently reduce the transport and cytotoxicity of adefovir mediated by the human renal organic anion transporter 1. J Pharmacol Exp Ther295:10-5 (2000) Solute carrier family 22 member 6
Name:Solute carrier family 22 member 6
Type:PROTEIN
Mol. Mass.:61831.78
Organism:Homo sapiens (Human)
Description:ChEMBL_1487359
Residue:563
BDBM50022271
NameBDBM50022271
Synonyms:2-(3-Benzoylphenyl)propionic acid 3-Benzoyl-alpha-methylbenzeneacetic acid CHEMBL571 KETOPROFEN Orudis (TN) | m-Benzoylhydratropic acid
TypeSmall organic molecule
Emp. Form.C16H14O3
Mol. Mass.254.2806
SMILESCC(C(O)=O)c1cccc(c1)C(=O)c1ccccc1