Reaction Details
TargetBroad substrate specificity ATP-binding cassette transporter ABCG2
LigandBDBM4566
Substrate/Competitorn/a
Meas. Tech.ChEMBL_835940 (CHEMBL2077078)
IC50 200±n/a nM
Citation Ozvegy-Laczka, CHegedus, TVárady, GUjhelly, OSchuetz, JDVáradi, AKéri, GOrfi, LNémet, KSarkadi, B High-affinity interaction of tyrosine kinase inhibitors with the ABCG2 multidrug transporter. Mol Pharmacol65:1485-95 (2004) 
 
Broad substrate specificity ATP-binding cassette transporter ABCG2
Name:Broad substrate specificity ATP-binding cassette transporter ABCG2
Type:Multi-pass membrane protein; monomer or homodimer; disulfide-linked
Mol. Mass.:72329.48
Organism:Homo sapiens (Human)
Description:Q9UNQ0
Residue:655
BDBM4566
NameBDBM4566
Synonyms:4-anilinoquinazoline deriv. 1 N-{4-[(3-bromophenyl)amino]quinazolin-6-yl}but-2-ynamide
TypeSmall organic molecule
Emp. Form.C18H13BrN4O
Mol. Mass.381.226
SMILESCC#CC(=O)Nc1ccc2ncnc(Nc3cccc(Br)c3)c2c1